{"text_format":"3","workbook":"xlsx","n_sheets":5,"sheets":["Inschrijfformulier","Vraagprogramma","Handleiding","Verenigingen","Inschijfgeld ed"],"not_rendered":{"images":3,"macros":1,"external_links":1,"defined_names":11,"comments":2},"read":"whole","date_system":"1900"}

{"sheet":"Inschrijfformulier","index":0,"n_rows":83,"n_cols":37,"rows_kept":83,"merged":[[0,0,3,0],[0,1,0,12],[1,1,1,12],[2,1,2,12],[4,1,4,12],[4,33,4,35],[5,1,5,12],[5,33,5,35],[6,1,6,12],[7,2,7,3],[7,4,7,12],[7,33,7,34],[8,2,8,3],[8,4,8,6],[8,8,8,9],[8,33,8,34],[9,2,9,3],[9,4,9,6],[9,8,9,9],[9,19,9,23],[9,33,9,34],[10,2,10,3],[10,4,10,6],[10,8,10,9],[10,19,10,23],[10,33,10,34],[11,2,11,3],[11,4,11,6],[11,8,11,9],[11,33,11,34],[12,2,12,3],[12,4,12,6],[12,8,12,9],[12,33,12,34],[13,2,13,3],[13,4,13,9],[13,33,13,34],[14,2,14,3],[14,4,14,6],[14,8,14,9],[14,33,14,34],[15,2,15,3],[15,4,15,6],[15,7,15,10],[15,33,15,34],[16,2,16,3],[16,4,16,10],[16,33,16,34],[17,4,17,6],[17,7,17,10],[17,33,17,34],[18,33,18,34],[19,4,20,12],[19,33,19,34],[20,2,20,3],[20,33,20,34],[21,2,21,3],[21,33,21,34],[22,2,22,3],[23,2,23,3],[23,33,23,34],[24,2,24,3],[25,2,25,3],[26,2,26,3],[27,2,27,3],[28,2,28,3],[29,2,29,3],[30,2,30,3],[31,2,31,3],[32,2,32,3],[32,33,32,34],[33,2,33,3],[34,2,34,3],[35,2,35,3],[36,2,36,3],[37,2,37,3],[38,2,38,3],[39,2,39,3],[39,33,39,34],[40,2,40,3],[41,2,41,3],[42,2,42,3],[43,2,43,3],[43,33,43,34],[44,2,44,3],[45,2,45,3],[46,2,46,3],[47,2,47,3],[48,2,48,3],[49,2,49,3],[50,2,50,3],[50,33,50,34],[51,2,51,3],[52,2,52,3],[53,2,53,3],[54,2,54,3],[55,2,55,3],[56,2,56,3],[57,2,57,3],[58,2,58,3],[59,2,59,3],[60,2,60,3],[61,2,61,3],[62,2,62,3],[63,2,63,3],[64,2,64,3],[65,2,65,3],[66,2,66,3],[68,6,68,10],[70,1,70,12],[72,1,72,12],[74,1,75,12],[76,1,76,12],[78,2,78,3],[78,4,78,5],[78,6,78,10],[79,1,79,12],[80,1,80,12],[81,1,81,12],[82,1,82,12]]}
["CONTROLE KOLOM",{"$f":"'Inschijfgeld ed'!B30","v":"t Sieske"}]
[null,{"$f":"'Inschijfgeld ed'!B31","v":"Stein"}]
[null,{"$f":"'Inschijfgeld ed'!B32","v":"AANGESLOTEN BIJ DE NEDERLANDSE BOND VAN VOGELLIEFHEBBERS"}]
[]
[">>>","INSCHRIJFFORMULIER",{"$nulls":31},"VERGEET ONDERSTAANDE NIET IN TE VULLEN"]
[">>>",{"$f":"'Inschijfgeld ed'!B34","v":"Internationale Tentoonstelling 2022"},{"$nulls":31},"(als u een van de onderstaande correct ingevuld heeft is het vak groen)"]
["▼▼","Uitleg over wat u in de gele vakken in moet vullen? Ga met uw muis op het vakje staan met het rode hoekje.",{"$nulls":12},{"$f":"O8+O18","v":0},null,null,"Ja",{"$nulls":15},"Correct ingevuld","Nog niet en/of niet correct ingevuld","Regel"]
[">>>","Kweeknummer:",null,null,"TOTAAL INSCHRIJFGELD",{"$nulls":9},{"$f":"LEN(C8)","v":0},{"$f":"IF(O8=4,0,IF(C8=\"\",0,LEN(C8)))","v":0},null,"Nee",{"$nulls":15},"Kweeknummer nog invullen (verplicht) ",null,"C8"]
[">>>","Ander C.O.M. nummer:",null,null,"Enkelingen:",null,null,{"$f":"G68","v":0},"x",null,{"$f":"IF(C20=\"Ja\",'Inschijfgeld ed'!B9,'Inschijfgeld ed'!B8)","v":{"v":2,"d":"€ 2.00"}},"=",{"$f":"H9*K9","v":0},null,0,{"$f":"IF(O9<10,0,IF(C9=\"\",0,LEN(C9)))","v":0},{"$nulls":17},"Ander C.O.M. nummer invullen (niet verplicht) ",null,"C9"]
[">>>","Achternaam:",null,null,"Stellen:",null,null,{"$f":"H68","v":0},"x",null,{"$f":"IF(C20=\"Ja\",'Inschijfgeld ed'!B17,'Inschijfgeld ed'!B16)","v":{"v":4,"d":"€ 4.00"}},"=",{"$f":"H10*K10","v":0},null,0,{"$f":"IF(O10<45,0,IF(C10=\"\",0,LEN(C10)))","v":0},{"$nulls":3},"Naam Inzender",{"$nulls":13},"Uw achternaam nog invullen (verplicht) ",null,"C10"]
[">>>","Tussenvoegsel:",null,null,"Stammen:",null,null,{"$f":"I68","v":0},"x",null,{"$f":"IF(C20=\"Ja\",'Inschijfgeld ed'!B13,'Inschijfgeld ed'!B12)","v":{"v":8,"d":"€ 8.00"}},"=",{"$f":"H11*K11","v":0},null,{"$f":"LEN(C11)","v":0},{"$f":"IF(O11<45,0,IF(C11=\"\",0,LEN(C11)))","v":0},{"$nulls":3},{"$f":"IF(C11=\"\", C10 & \" \" & C12,C10 & \" \" & C11 & \" \" & C12)","v":" "},{"$nulls":13},"Eventueel uw tussenvoegsels nog invullen (indien van toepassing verplicht)",null,"C11"]
[">>>","Voorletters:",null,null,"Open Klasse (O.E.K.):",null,null,{"$f":"J68","v":0},"x",null,{"$f":"IF(C20=\"Ja\",'Inschijfgeld ed'!B9,'Inschijfgeld ed'!B8)","v":{"v":2,"d":"€ 2.00"}},"=",{"$f":"H12*K12","v":0},null,0,0,{"$nulls":17},"Uw voorletters nog invullen",null,"C12"]
[">>>","Adres:",null,null,"Open Klasse (O.K.):",null,null,{"$f":"K68","v":0},"x",null,{"$f":"IF(C20=\"Ja\",'Inschijfgeld ed'!B9,'Inschijfgeld ed'!B8)","v":{"v":2,"d":"€ 2.00"}},"=",{"$f":"H13*K13","v":0},null,{"$f":"LEN(C13)","v":0},{"$f":"IF(O13<30,0,IF(C13=\"\",0,LEN(C13)))","v":0},null,{"$f":"SUM(M9:M13)","v":0},"<< totaal M9 t/m M13",{"$nulls":14},"Uw adres nog invullen (verplicht) ",null,"C13"]
[">>>","Postcode:",null,null,"Admi-, portokosten en verplichte catalogus:",{"$nulls":7},{"$f":"IF(C20=\"Ja\",'Inschijfgeld ed'!B21,'Inschijfgeld ed'!B20)","v":{"v":2.5,"d":"€ 2.50"}},null,0,{"$f":"IF(O14=7,0,IF(C14=\"\",0,LEN(C14)))","v":0},{"$nulls":17},"Uw postcode nog invullen (verplicht)",null,"C12"]
[">>>","Woonplaats:",null,null,"Evt. kooihuur:",null,null,{"$f":"M68","v":0},"x",null,{"$f":"IF(C20=\"Ja\",'Inschijfgeld ed'!B25,'Inschijfgeld ed'!B24)","v":{"v":0,"d":"€ 0.00"}},"=",{"$f":"H15*K15","v":0},null,0,{"$f":"IF(O15<30,0,IF(C15=\"\",0,LEN(C15)))","v":0},null,{"$f":"M14:M15","v":{"v":2.5,"d":"€ 2.50"}},"<< totaal M14 t/m M15",{"$nulls":14},"Uw woonplaats nog invullen (verplicht) ",null,"C13"]
[">>>","Telefoonnummer: ",null,null,"Extra bijdrage ",{"$nulls":6},"=",null,null,0,{"$f":"IF(O16<20,0,IF(C16=\"\",0,LEN(C16)))","v":0},null,0,{"$nulls":15},"Uw telefoonummer nog invullen (bijv. 000-0000000) (niet verplicht) ",null,"C14"]
[">>>","Mobielnummer: ",null,null,"U komt met het hier achterstaande aantal eigen kooien:",{"$nulls":6},{"$f":"G69-M68","v":0},"=====+",null,0,{"$f":"IF(O17<20,0,IF(C17=\"\",0,LEN(C17)))","v":0},null,"Max.In.",{"$nulls":15},"Uw mobielnummer nog invullen (bijv. 06-00000000) (niet verplicht) ",null,"C15"]
[">>>","Lid afdeling: (code)",null,{"$f":"IF(C18=\"\",\"\",IFERROR(VLOOKUP(C18,Verenigingen!A4:B452,2,FALSE),\"Onbekend\"))","v":""},"Uw prijskeuze is:",null,null,"Bekers",{"$nulls":3},"Te betalen:",{"$f":"S18","v":{"v":2.5,"d":"€ 2.50"}},null,0,{"$f":"IF(O18=3,0,IF(C18=\"\",0,LEN(C18)))","v":0},{"$f":"IF(D18=\"Onbekend\",1,0)","v":0},{"$f":"'Inschijfgeld ed'!B28","v":{"v":999.99,"d":"€ 999.99"}},{"$f":"IF(R13<R18,R13+R15+M16,R18+R15+M16)","v":{"v":2.5,"d":"€ 2.50"}},{"$nulls":14},"De code van uw verenigingen nog invullen (verplicht) ",null,"C16"]
[">>>","Lid Speciaalclub: (naam)",{"$f":"IFERROR(IF(D19= \"N.V.T. Wordt niet gevraagd op deze TT\",\"\",VLOOKUP(D19,Verenigingen!F3:G32,2,FALSE)),\"\")","v":""},null,{"$f":"S19& \" \" & X19","v":"Het max. inschrijfgeld bedraagt (excl. Admi-, portokosten en catalogus):"},{"$nulls":7},{"$f":"R18","v":{"v":999.99,"d":"€ 999.99"}},null,0,{"$f":"IF(O19=3,0,IF(C19=\"\",0,LEN(C19)))","v":0},null,{"$f":"IF(R18<999.99,1,0)","v":0},"Het max. inschrijfgeld bedraagt",{"$nulls":4},"(excl. Admi-, portokosten en catalogus):",{"$nulls":9},"De naam van de speciaalclub nog invullen via Dropdownbox (niet verplicht) ",null,"D17"]
[">>>","Jeugdinzender: (Ja/Nee)",null,"Jeugdinzender",{"$f":" \"Sluiting inschrijving: \" &'Inschijfgeld ed'!B36","v":"Sluiting inschrijving: 20 November 2022"},{"$nulls":9},{"$f":"IF(C20=\"Ja\",1,IF(C20=\"Nee\",2,IF(C20=\"\",3)))","v":3},{"$f":"IF(C20= \"Ja\",1,0)","v":0},{"$nulls":17},"Jeugdinzender Ja/Nee nog aangeven (verplicht via Dropdownbox) ",null,"C18"]
[">>>","Geboortedatum:",{"$nulls":12},{"$f":"LEN(C21)","v":0},{"$nulls":18},"Bij jeugdinzender \"Ja\" geboorte datum invullen (DD-MM-JJJJ) (verplicht) ",null,"C19"]
[null,"KLASSE","Soort  en/of Kleurslag van de Vogel",null,"Soort","Aantal","Aantal","Aantal","Aantal","Aantal","Aantal","Verz.","Aantal",{"$nulls":6},"Totaal",{"$nulls":13},"U heeft uw E-mailadres nog niet ingevuld (Verplicht bij verzenden via E-mail)",null,"C77"]
[null,"zonder punten of komma's","Wordt automatisch ingevuld als u de juiste klasse intikt.",null,"kooi","jaren","Enkelingen","Stellen","Stammen","O.E.K.","O.K.","Bedrag ","Huurkooien",null,"Enk.","Stel","Stam","OEK","OK","vogels","Klasse","Omsch.","T+U","Kolom B","Kolom T","W+X",null,"Verz."]
[">>>",null,{"$f":"IF(B24=\"\",\"\",IF(ISERROR(VLOOKUP(Inschrijfformulier!B24,Vraagprogramma!A:B,2,FALSE)),\"Onbekend\",(VLOOKUP(Inschrijfformulier!B24,Vraagprogramma!A:B,2,FALSE))))","v":""},null,{"$f":"IF(24=\" \",\" \",IF(ISERROR(VLOOKUP(Inschrijfformulier!C24,Vraagprogramma!B:D,3,FALSE)),\" \",(VLOOKUP(Inschrijfformulier!C24,Vraagprogramma!B:D,3,FALSE))))","v":" "},{"$f":"IF(24=\" \",\" \",IF(ISERROR(VLOOKUP(Inschrijfformulier!C24,Vraagprogramma!B:E,4,FALSE)),\" \",(VLOOKUP(Inschrijfformulier!C24,Vraagprogramma!B:E,4,FALSE))))","v":" "},{"$nulls":7},{"$f":"IF(T24>0,1,0)","v":0},{"$f":"LEN(G24)","v":0},{"$f":"LEN(H24)","v":0},{"$f":"LEN(I24)","v":0},{"$f":"LEN(J24)","v":0},{"$f":"LEN(K24)","v":0},{"$f":"G24+(H24*2)+(I24*4)+J24+K24","v":0},{"$f":"IF(B24=\"\",0,1)","v":0},{"$f":"IF(C24=\"Onbekend\",1,0)","v":0},{"$f":"T24+U24","v":0},{"$f":"IF(B24<>\"\",1,0)","v":0},{"$f":"IF(T24>0,1,0)","v":0},{"$f":"IF(Y24=1,IF(X24=1,2,1),0)","v":0},{"$f":"AB24+U24+N24","v":0},{"$f":"IF(L24<>\"\",1,0)","v":0},{"$f":"AA24+AB24","v":0},{"$f":"IF(AC24=0,1,0)","v":1},{"$f":"IF(AD24=1,0,0)","v":0},38,null,"INVOEREN VOGELS",null,"VB"," "]
[">>>",null,{"$f":"IF(B25=\"\",\"\",IF(ISERROR(VLOOKUP(Inschrijfformulier!B25,Vraagprogramma!A:B,2,FALSE)),\"Onbekend\",(VLOOKUP(Inschrijfformulier!B25,Vraagprogramma!A:B,2,FALSE))))","v":""},null,{"$f":"IF(24=\" \",\" \",IF(ISERROR(VLOOKUP(Inschrijfformulier!C25,Vraagprogramma!B:D,3,FALSE)),\" \",(VLOOKUP(Inschrijfformulier!C25,Vraagprogramma!B:D,3,FALSE))))","v":" "},{"$f":"IF(24=\" \",\" \",IF(ISERROR(VLOOKUP(Inschrijfformulier!C25,Vraagprogramma!B:E,4,FALSE)),\" \",(VLOOKUP(Inschrijfformulier!C25,Vraagprogramma!B:E,4,FALSE))))","v":" "},{"$nulls":7},{"$f":"IF(T25>0,1,0)","v":0},0,0,0,0,0,0,0,{"$f":"IF(C25=\"Onbekend\",1,0)","v":0},0,0,0,{"$f":"IF(Y25=1,IF(X25=1,2,1),0)","v":0},0,0,{"$f":"AA25+AB25","v":0},1,0,37,null,"- Kolommen B24 tm B52 moet aansluitend gevuld worden",null,"LET OP !"]
[">>>",null,{"$f":"IF(B26=\"\",\"\",IF(ISERROR(VLOOKUP(Inschrijfformulier!B26,Vraagprogramma!A:B,2,FALSE)),\"Onbekend\",(VLOOKUP(Inschrijfformulier!B26,Vraagprogramma!A:B,2,FALSE))))","v":""},null,{"$f":"IF(24=\" \",\" \",IF(ISERROR(VLOOKUP(Inschrijfformulier!C26,Vraagprogramma!B:D,3,FALSE)),\" \",(VLOOKUP(Inschrijfformulier!C26,Vraagprogramma!B:D,3,FALSE))))","v":" "},{"$f":"IF(24=\" \",\" \",IF(ISERROR(VLOOKUP(Inschrijfformulier!C26,Vraagprogramma!B:E,4,FALSE)),\" \",(VLOOKUP(Inschrijfformulier!C26,Vraagprogramma!B:E,4,FALSE))))","v":" "},{"$nulls":7},0,0,0,0,0,0,0,0,0,0,0,0,0,0,0,0,1,0,36,null,"- Als u de vogels welke u wilt inschrijven correct zijn ingeschreven zal voor de ",null,">>>"]
[">>>",null,{"$f":"IF(B27=\"\",\"\",IF(ISERROR(VLOOKUP(Inschrijfformulier!B27,Vraagprogramma!A:B,2,FALSE)),\"Onbekend\",(VLOOKUP(Inschrijfformulier!B27,Vraagprogramma!A:B,2,FALSE))))","v":""},null,{"$f":"IF(24=\" \",\" \",IF(ISERROR(VLOOKUP(Inschrijfformulier!C27,Vraagprogramma!B:D,3,FALSE)),\" \",(VLOOKUP(Inschrijfformulier!C27,Vraagprogramma!B:D,3,FALSE))))","v":" "},{"$f":"IF(24=\" \",\" \",IF(ISERROR(VLOOKUP(Inschrijfformulier!C27,Vraagprogramma!B:E,4,FALSE)),\" \",(VLOOKUP(Inschrijfformulier!C27,Vraagprogramma!B:E,4,FALSE))))","v":" "},{"$nulls":7},0,0,0,0,0,0,0,0,0,0,0,0,0,0,0,0,1,0,35,null,"klasse het vakje groen worden. (kolom A)"]
[">>>",null,{"$f":"IF(B28=\"\",\"\",IF(ISERROR(VLOOKUP(Inschrijfformulier!B28,Vraagprogramma!A:B,2,FALSE)),\"Onbekend\",(VLOOKUP(Inschrijfformulier!B28,Vraagprogramma!A:B,2,FALSE))))","v":""},null,{"$f":"IF(24=\" \",\" \",IF(ISERROR(VLOOKUP(Inschrijfformulier!C28,Vraagprogramma!B:D,3,FALSE)),\" \",(VLOOKUP(Inschrijfformulier!C28,Vraagprogramma!B:D,3,FALSE))))","v":" "},{"$f":"IF(24=\" \",\" \",IF(ISERROR(VLOOKUP(Inschrijfformulier!C28,Vraagprogramma!B:E,4,FALSE)),\" \",(VLOOKUP(Inschrijfformulier!C28,Vraagprogramma!B:E,4,FALSE))))","v":" "},{"$nulls":7},0,0,0,0,0,0,0,0,0,0,0,0,0,0,0,0,1,{"$f":"IF(AD28=1,0,0)","v":0},34,null,"- Als nog niet alles is ingevuld zal het vakje voor de klasse roze/bruin kleuren.",null,">>>"]
[">>>",null,{"$f":"IF(B29=\"\",\"\",IF(ISERROR(VLOOKUP(Inschrijfformulier!B29,Vraagprogramma!A:B,2,FALSE)),\"Onbekend\",(VLOOKUP(Inschrijfformulier!B29,Vraagprogramma!A:B,2,FALSE))))","v":""},null,{"$f":"IF(24=\" \",\" \",IF(ISERROR(VLOOKUP(Inschrijfformulier!C29,Vraagprogramma!B:D,3,FALSE)),\" \",(VLOOKUP(Inschrijfformulier!C29,Vraagprogramma!B:D,3,FALSE))))","v":" "},{"$f":"IF(24=\" \",\" \",IF(ISERROR(VLOOKUP(Inschrijfformulier!C29,Vraagprogramma!B:E,4,FALSE)),\" \",(VLOOKUP(Inschrijfformulier!C29,Vraagprogramma!B:E,4,FALSE))))","v":" "},{"$nulls":7},0,0,0,0,0,0,0,0,0,0,0,0,0,0,0,0,1,{"$f":"IF(AD29=1,0,0)","v":0},33,null,"- Als in de kolom (B24 t/m B52) een dubbele klasse ingevoerd wordt,worden",null,{"v":1001001,"d":"1,001,001"}]
[">>>",null,{"$f":"IF(B30=\"\",\"\",IF(ISERROR(VLOOKUP(Inschrijfformulier!B30,Vraagprogramma!A:B,2,FALSE)),\"Onbekend\",(VLOOKUP(Inschrijfformulier!B30,Vraagprogramma!A:B,2,FALSE))))","v":""},null,{"$f":"IF(24=\" \",\" \",IF(ISERROR(VLOOKUP(Inschrijfformulier!C30,Vraagprogramma!B:D,3,FALSE)),\" \",(VLOOKUP(Inschrijfformulier!C30,Vraagprogramma!B:D,3,FALSE))))","v":" "},{"$f":"IF(24=\" \",\" \",IF(ISERROR(VLOOKUP(Inschrijfformulier!C30,Vraagprogramma!B:E,4,FALSE)),\" \",(VLOOKUP(Inschrijfformulier!C30,Vraagprogramma!B:E,4,FALSE))))","v":" "},{"$nulls":7},0,0,0,0,0,0,0,0,0,0,0,0,0,0,0,0,1,0,32,null,"de vakjes roze met rode letter verschijnen. U mag maar 1 regel per "]
{"$rows_left_out":54}
{"sheet":"Vraagprogramma","index":1,"n_rows":6842,"n_cols":8,"rows_kept":6842,"merged":[[0,0,0,4],[0,6,0,7]]}
["VRAAGPROGRAMMA 2020-2024 (VERSIE JANUARI 2021)",{"$nulls":5},"UITLEG, HOE GEBRUIKT U DE ZOEKFUNCTIE"]
["Klasse","Soort",null,"Kooi","Aantal jaar",null,"Om in deze lijst te kunnen zoeken naar een klasse-nummer kunt u de zoekfunctie gebruiken."]
[1001001,"ZangKan.Harzer kloekvrij",null,1,1,null,"Deze zoekfunctie activeert u door de CTRL-knop op uw toetsenbord ingedrukt te houden"]
[1001002,"ZangKan.Harzer met kloeken",null,1,1,null,"en dan vervolgens op de letter F te klikken. Dan verschijnt het hieronder staand scherm."]
[1002001,"ZangKan.Waterslagers",null,1,1]
[1003001,"ZangKan.Timbrado original",null,1,2]
[1003002,"ZangKan.Timbrado floreado",null,1,2]
[2001001,"Kl.Kan.Lipochroom wit dominant",null,2,2]
[2002001,"Kl.Kan.Lipochroom wit",null,2,2]
[2003001,"Kl.Kan.Lipochroom albino dominant",null,2,2]
[2003002,"Kl.Kan.Lipochroom albino",null,2,2]
[2005001,"Kl.Kan.Lipochroom geel intensief",null,2,2,null,"Vervolgens kunt u in het vakje achter \"Zoeken naar\" de naam, of een gedeelte daarvan, van de"]
[2005002,"Kl.Kan.Lipochroom geelivoor intensief",null,2,2,null,"gewenste vogel intikken. Vervolgens klikt u met uw muis op de knop \"Volgende zoeken\"."]
[2005003,"Kl.Kan.Lipochroom geel intensief witte pennen",null,2,2,null,"Als u dan uw vogel gevonden heeft staat voor de naam het klasse-nummer en dit nummer gebruikt"]
[2005004,"Kl.Kan.Lipochroom geelivoor intensief witte pennen",null,2,2,null,"u vervolgens in het tabblad \"Inschrijfformulier\". En als u dit klasse-nummer heeft ingetikt (niet kopieren/plakken)"]
[2007001,"Kl.Kan.Lipochroom lutino intensief",null,2,2,null,"verschijnt de naam van uw vogel in het vakje er naast."]
[2007002,"Kl.Kan.Lipochroom lutino-ivoor intensief",null,2,2,null,"Heeft u nog niet de juiste vogel gevonden dan klikt u met uw muis weer op de knop \"Volgende zoeken\""]
[2007003,"Kl.Kan.Lipochroom lutino intensief witte pennen",null,2,2,null,"Dit doet u net zolang tot dat u uw gewenste vogel gevonden heeft."]
[2007004,"Kl.Kan.Lipochroom lutino-ivoor int.witte pennen",null,2,2,null,"Als u klaar bent met zoeken kunt u, in het zoekscherm op de knop \"Sluiten\" klikken met uw muis."]
[2009001,"Kl.Kan.Lipochroom geel schimmel",null,2,2]
[2009002,"Kl.Kan.Lipochroom geelivoor schimmel",null,2,2,null,"In de kolom:"]
[2009003,"Kl.Kan.Lipochroom geel schimmel witte pennen",null,2,2,null,"Klasse (kolom A):","Staat het klasse-nummer, voor het gewenste klasse-nummer in (kolom B, regel 22 t/m 60)"]
[2009004,"Kl.Kan.Lipochroom geelivoor schimmel witte pennen",null,2,2,null,null,"in het tabblad \"Inschrijfformulier\"."]
[2011001,"Kl.Kan.Lipochroom lutino schimmel",null,2,2,null,"Soort (kolom B): ","Staat de naam en eventueel de kleurslag (*)."]
[2011002,"Kl.Kan.Lipochroom lutino-ivoor schimmel",null,2,2,null,"Kooi (kolom C):","Staat het nummer van de soortkooi waar de vogel in tentoongesteld moet worden (*)."]
[2011003,"Kl.Kan.Lipochroom lutino schimmel witte pennen",null,2,2,null,"Aantal jaar (kolom D):","Staat hoeveel jaar een vogel mee mag doen als eigenkweekvogel (*)."]
[2011004,"Kl.Kan.Lipochroom lutino-ivoor schimmel witte pennen",null,2,2]
[2013001,"Kl.Kan.Lipochroom geel mozaiek T1",null,2,2,null,null,"(*) Deze gegevens worden automatisch in het tabblad \"Inschrijfformulier\" in de juiste vakken"]
[2013002,"Kl.Kan.Lipochroom lutino mozaiek T1",null,2,2,null,null,"ingevoerd als u het klasse-nummer in het tabblad \"Inschrijfformulier\" heeft ingevoerd."]
[2013003,"Kl.Kan.Lipochroom geelivoor mozaiek T1",null,2,2]
{"$rows_left_out":6813}
{"sheet":"Handleiding","index":2,"n_rows":81,"n_cols":8,"rows_kept":81,"merged":[[0,0,0,12],[1,0,1,12],[6,0,6,8],[7,0,7,8],[8,0,8,8],[9,2,9,8],[11,2,11,8],[14,2,14,8],[15,2,15,8],[16,2,16,8],[17,2,17,8],[18,2,18,8],[19,2,19,8],[22,2,22,11],[23,2,23,8],[25,2,25,8],[28,0,28,8],[29,0,29,12],[30,0,30,12],[34,0,34,12],[37,0,37,8],[38,0,38,8],[39,0,39,12],[40,0,40,12],[41,0,41,8],[42,0,42,8],[43,2,43,12],[44,2,44,8],[46,2,46,12],[47,2,47,12],[49,2,49,12],[50,2,50,8],[51,2,51,12],[52,2,52,12],[53,2,53,8],[54,2,54,8],[55,2,55,8],[56,2,56,8],[57,2,57,8],[58,2,58,8],[59,2,59,8],[60,2,60,8],[61,2,61,12],[62,2,62,8],[63,2,63,12],[64,0,64,8],[65,0,65,12],[66,0,66,8],[67,0,67,8],[68,0,68,8],[69,2,69,8],[71,0,71,8],[72,0,72,12],[73,0,73,8],[74,0,74,8],[75,0,75,8],[76,0,76,12],[78,0,78,8]]}
["Handleiding invullen van het inschrijfformulier"]
["Wat moet u allemaal invullen om een zo'n compleet mogelijk inschrijfformulier in te leveren"]
[]
["Het Digitale inschrijfformulier is gemaakt om het voor u en uw TT-Secretaris zo gemakkelijk mogelijk te maken."]
["Er zijn diverse controles ingebouwd zodat u niets kunt vergeten om dit formulier goed in te kunnen vullen, succes."]
["LET OP! een APOSTROF ( ' ) mag in de tekstvakken niet gebruikt worden en een spatie is ook een karakter."]
[]
["NAW-gegevens"]
["Hieronder vul jij de diverse gevraagde gegevens in"]
["Kweeknummer:",":","Vul hier uw kweeknummer in (verplicht - 4 karakters)"]
["Ander C.O.M. nummer:",":","Vul hier een ander kweeknummer dan uw NBvV-kweeknummer in (niet verplicht - max.10 karakters)"]
["Achternaam:",":","Vul hier uw achternaam in (verplicht - max.28 karakters)"]
["Tussenvoegsel:",null,"Indien van toepassing vul hier uw tussenvoegsel in (indien van toepassing verplicht - max.8 karakters)"]
["Voorletters:",null,"Vul hier uw voorletters in (verplicht - max 7 karakters)"]
["Adres:",":","Vul hier uw adres in (verplicht - max.30 karakters)"]
["Postcode:",":","Vul hier uw postcode in (verplicht - max.7 karakters)"]
["Woonplaats:",":","Vul hier uw woonplaats in (verplicht - max.30 karakters)"]
["Telefoonnummer: ",":","Vul hier uw telefoonnummer in (verplicht - max.20 karakters)"]
["Mobielnummer: ",":","Vul hier uw mobielnummer in (verplicht - max.20 karakters)"]
["Lid afdeling: (code)",":","Vul hier de code van de vereniging in waar u lid van bent (verplicht - 3 karakters)"]
[null,null,"Als u de juiste code van uw vereniging heeft ingevuld verschijnt de naam en plaats van uw vereniging"]
[null,null,"Komt er \"Onbekend\" te staan is de verenigingscode waarschijnlijk fout. Probeer het opnieuw."]
["Lid Speciaalclub: (naam)",":","Vul hier de naam van de speciaalclub in waar u ook lid van bent (niet verplicht en indien gevraagd)"]
["Jeugdinzender: (Ja/Nee)",":","Vul hier \"Ja\" in als u een jeugdinzender bent (niet verplicht - Ja of Nee)"]
[null,null,"Maak hiervoor uw keuze in met de dropdownbox, welke rechts naast \"Jeugdinzender (Ja/Nee) zichtbaar is."]
["Geboortedatum:",":","Als uw \"Ja\" bij jeugdinzender hebt ingevuld moet jij uw geboortedatum invullen (alleen verplicht bij \"Ja\")"]
["Maak uw keuze:",":  Indien \"Maak uw keuze\" zichtbaar is kunt u in het vak rechts ernaast aangeven wat uw wens is."]
[null,null,"Maak hiervoor uw keuze in de dropdownbox, welke rechts naast \"Maak uw Keuze\" zichtbaar is."]
[]
["Als u het bovenstaande allemaal heeft ingevuld dan kunt u vervolgens uw vogels inschrijven welke u in wil zenden voor de "]
{"$rows_left_out":52}
{"sheet":"Verenigingen","index":3,"n_rows":456,"n_cols":13,"rows_kept":456,"hidden":true,"merged":[[0,0,0,1],[0,3,0,5],[0,9,0,11],[38,4,38,11],[39,4,39,11],[40,4,40,11],[41,4,41,11],[42,4,42,11],[43,4,43,11],[44,4,44,11],[45,4,45,11],[46,4,46,11],[47,4,47,11],[49,4,49,11]]}
["Verenigingen",null,null,"Speciaalclubs voor in het Dropdown menu",{"$nulls":5},"Speciaalclubs invoeren"]
["Ver.Code (3)","Verenigingsnaam/plaats ",null,"R","Ver.Code (3)","Verenigingsnaam/plaats ",{"$nulls":3},"R","Ver.Code (3)","Verenigingsnaam/plaats "]
[{"$nulls":6},{"$f":"IF(E3=\"\",\"\",E3)","v":""}]
[109,"v.v. Kampen 2 - Kampen 2",null,1,"BEC",{"$f":"IFERROR(VLOOKUP(E4,K$3:L$32,2,FALSE),\"\")","v":"Belangenbehartiging Europese Cultuurvogel"},{"$f":"IF(E4=\"\",\"\",UPPER(E4))","v":"BEC"},{"$f":"IF(E4=\"\",\"\",LEN(E4))","v":3},null,1,"NVT","N.V.T. Wordt niet gevraagd op deze TT",{"$f":"IF(K4=\"\",\"\",LEN(K4))","v":3}]
[113,"v.v. Vries - Vries",null,2,null,"",{"$f":"IF(E5=\"\",\"\",UPPER(E5))","v":""},{"$f":"IF(E5=\"\",\"\",LEN(E5))","v":""},null,2,"SAP","Spec.club Afrikaanse Prachtvinken (AP)",{"$f":"IF(K5=\"\",\"\",LEN(K5))","v":3}]
[218,"v.v. Utrecht 1 - Utrecht 1",null,3,null,"","","",null,3,"IVV","Spec.club van Insecten- en Vruchtenetende Vogels (IVV)",3]
[219,"v.v. Utrecht 2 - Utrecht 2",null,4,null,"","","",null,4,"JMC","Spec.club Jap.meeuwen en overige lonchura's (JMC)",3]
[305,"v.v. Delden - Delden",null,5,null,"","","",null,5,"SNG","Spec.club Natuurbroed Gouldamadine Ned.(SNGN)",3]
[308,"v.v. Bennekom - Bennekom",null,6,null,"","","",null,6,"NKC","Ned.Kleurkanarie Club (NKC)",3]
[311,"v.v. Didam 2 - Didam 2",null,7,null,"","","",null,7,"MOZ","Ned.Speciaalclub Mozaiek Kanaries (MOZ)",3]
[312,"v.v. Beckum - Beckum",null,8,null,"","","",null,8,"NZC","Ned.Zebravinken Club (NZC)",3]
[314,"v.v. Ede - Ede",null,9,null,"","","",null,9,"PSC","Parkieten Spec.club (PSC)",3]
[319,"v.v. Ons Genoegen - Haaksbergen 2",null,10,null,"","","",null,10,"SCA","SC Austr.Prachtvinken & Papegaai Amadines (SCAP)",3]
[320,"v.v. Hattem - Hattem",null,11,null,"","","",null,11,"TIM","Spanish Timbrado Society (TIM)",3]
[324,"v.v. De Gevleugelde Zanger - Lichtenvoorde",null,12,null,"","","",null,12,"SEC","Spec.club Europese Cultuurvogels (SEC)",3]
[326,"v.v. Losser - Losser",null,13,null,"","","",null,13,"SKN","Spec.club Kleurkanarie N-N (SKNN)",3]
[332,"v.v. Oldenzaal 3 - Oldenzaal 3",null,14,null,"","","",null,14,"SCK","Spec.club Kleurkanaries (SCK)",3]
[334,"v.v. Doesburg 2 - Doesburg 2",null,15,null,"","","",null,15,"HAR","Spec.club L.S.H. Harzers (HARZERS)",3]
[335,"v.v. Ruurlo - Ruurlo",null,16,null,"","","",null,16,"NPV","Spec.club Postuurkanaries NPV (NPV)",3]
[336,"v.v. Rijssen 3 - Rijssen 3",null,17,null,"","","",null,17,"SWS","Spec.club Waterslagers \"De Nachtegaal\"  (WS)",3]
[340,"v.v. Partropika - Apeldoorn 4",null,18,null,"","","",null,18,"ZHU","Spec.club Zangkanaries (NZHU)",3]
[341,"v.v. Velp - Velp",null,19,null,"","","",null,19,"WAS","Werkgroep Amerikaanse Sijzen (WAS)",3]
[342,"v.v. Vorden - Vorden",null,20,null,"","","",null,20,"WPL","Werkgroep PLOCEIDAE (WP)",3]
[343,"v.v. Vriezenveen 2 - Vriezenveen 2",null,21,null,"","","",null,21,"BEC","Belangenbehartiging Europese Cultuurvogel",3]
[350,"v.v. Zelhem - Zelhem",null,22,null,"","","",null,22,null,null,""]
[355,"v.v. Eibergen - Eibergen",null,23,null,"","","",null,23,null,null,""]
[358,"v.v. Zwolle - Zwolle 4",null,24,null,"","","",null,24,null,null,""]
[361,"v.v. Tolkamer - Tolkamer",null,25,null,"","","",null,25,null,null,""]
[402,"v.v. Exparka - Belfeld",null,26,null,"","","",null,26,null,null,""]
[408,"v.v. Kerkrade - Kerkrade 6",null,27,null,"","","",null,27,null,null,""]
{"$rows_left_out":427}
{"sheet":"Inschijfgeld ed","index":4,"n_rows":58,"n_cols":2,"rows_kept":58,"hidden":true,"merged":[[0,0,0,1],[1,0,1,1],[5,0,5,1],[6,0,6,1],[10,0,10,1],[14,0,14,1],[18,0,18,1],[22,0,22,1],[26,0,26,1]]}
["Alleen de gele gemarkeerde vakken aanpassen"]
["Jeugd"]
["Jeugd - Ja","Ja"]
["Jeugd - Nee","Nee"]
[]
["Inschrijfgeld"]
["Enkelingen (EK) / Overjarig Eigenkweek (OEK) / Open Klasse (OK)"]
["senioren",{"v":2,"d":"€ 2.00"}]
["Jeugd",{"v":2,"d":"€ 2.00"}]
[null,"▲ altijd ingevuld houden, wordt er geen inschrijfgeld gevraagd dan € 0,00 invullen"]
["Stammen"]
["senioren",{"v":8,"d":"€ 8.00"}]
["jeugd",{"v":8,"d":"€ 8.00"}]
[null,"▲ altijd ingevuld houden, wordt er geen inschrijfgeld gevraagd dan € 0,00 invullen"]
["Stellen"]
["senioren",{"v":4,"d":"€ 4.00"}]
["jeugd",{"v":4,"d":"€ 4.00"}]
[null,"▲ altijd ingevuld houden, wordt er geen inschrijfgeld gevraagd dan € 0,00 invullen"]
["catalogus/portokosten"]
["senioren",{"v":2.5,"d":"€ 2.50"}]
["jeugd",{"v":2.5,"d":"€ 2.50"}]
[null,"▲ altijd ingevuld houden, wordt er geen catalogus/port gevraagd dan € 0,00 invullen"]
["Huurkooi"]
["Senioren",{"v":0,"d":"€ 0.00"}]
["Jeugd",{"v":0,"d":"€ 0.00"}]
[null,"▲ altijd ingevuld houden, wordt er geen catalogus/port gevraagd dan € 0,00 invullen"]
["Maximaal inschrijfkosten (exclusief porto-, Cataloguskosten en eventueel kooihuur)"]
["Max.Inschrijfkosten",{"v":999.99,"d":"€ 999.99"}]
[null,"▲ altijd ingevuld houden, geen max.inschrijfgeld dag € 999,99 invullen)"]
["Verenigingsnaam","t Sieske"]
{"$rows_left_out":28}